fixup! Reduce rwlock contention in isc_log_wouldlog()

76 jobs for !3321 with 1717-rwlock-contention-in-isc_log_wouldlog-api-performance-impact in 33 minutes and 33 seconds (queued for 7 minutes and 36 seconds)
detached
Status Job ID Name Coverage
  Precheck
passed #798751
amd64 linux
autoreconf

00:00:19

passed #798753
amd64 linux
clang-format

00:00:23

passed #798754
amd64 linux
coccinelle

00:04:38

passed #798752
amd64 linux
misc

00:00:18

 
  Build
passed #798770
amd64 linux
clang:asan

00:01:39

passed #798774
amd64 linux
clang:buster:amd64

00:02:21

passed #798776
amd64 libvirt
clang:freebsd11.3:amd64

00:01:46

passed #798777
amd64 libvirt
clang:freebsd12.1:amd64

00:01:41

passed #798778
amd64 libvirt
clang:openbsd6.6:amd64

00:04:48

passed #798772
amd64 linux
clang:tsan

00:01:38

passed #798755
amd64 linux
gcc:alpine3.11:amd64

00:02:13

passed #798769
amd64 linux
gcc:asan

00:01:25

passed #798768
amd64 linux
gcc:bionic:amd64

00:01:14

passed #798760
amd64 linux
gcc:buster:amd64

00:00:59

passed #798756
amd64 linux
gcc:centos6:amd64

00:01:47

passed #798757
amd64 linux
gcc:centos7:amd64

00:02:01

passed #798758
amd64 linux
gcc:centos8:amd64

00:02:10

passed #798766
amd64 linux
gcc:fedora31:amd64

00:01:59

passed #798773
amd64 linux
gcc:mutexatomics

00:01:09

passed #798762
amd64 linux
gcc:out-of-tree

00:01:01

passed #798775
amd64 linux
gcc:pkcs11

00:01:09

passed #798761
amd64 linux
gcc:sid:amd64

00:01:06

passed #798763
arm64 linux
gcc:sid:arm64

00:02:34

passed #798764
i386 linux
gcc:sid:i386

00:00:52

passed #798759
amd64 linux
gcc:stretch:amd64

00:01:12

passed #798771
amd64 linux
gcc:tsan

00:01:08

passed #798765
amd64 linux
gcc:tumbleweed:amd64

00:01:55

passed #798767
amd64 linux
gcc:xenial:amd64

00:00:57

passed #798779
amd64 windows
msvc:windows:amd64

00:16:43

 
  Unit
passed #798794
amd64 linux
unit:clang:asan

00:00:54

passed #798798
amd64 linux
unit:clang:buster:amd64

00:00:35

passed #798800
amd64 libvirt
unit:clang:freebsd11.3:amd64

00:01:04

passed #798801
amd64 libvirt
unit:clang:freebsd12.1:amd64

00:01:01

failed #798796
amd64 linux allowed to fail
unit:clang:tsan

00:00:17

passed #798780
amd64 linux
unit:gcc:alpine3.11:amd64

00:00:38

passed #798793
amd64 linux
unit:gcc:asan

00:00:52

passed #798792
amd64 linux
unit:gcc:bionic:amd64

00:00:39

passed #798785
amd64 linux
unit:gcc:buster:amd64

00:00:37

passed #798781
amd64 linux
unit:gcc:centos6:amd64

00:00:37

passed #798782
amd64 linux
unit:gcc:centos7:amd64

00:00:38

passed #798783
amd64 linux
unit:gcc:centos8:amd64

00:00:41

passed #798790
amd64 linux
unit:gcc:fedora31:amd64

00:00:38

passed #798797
amd64 linux
unit:gcc:mutexatomics

00:00:35

passed #798799
amd64 linux
unit:gcc:pkcs11

00:00:38

passed #798786
amd64 linux
unit:gcc:sid:amd64

00:00:45

passed #798787
arm64 linux
unit:gcc:sid:arm64

00:01:05

passed #798788
i386 linux
unit:gcc:sid:i386

00:00:38

passed #798784
amd64 linux
unit:gcc:stretch:amd64

00:00:35

failed #798795
amd64 linux allowed to fail
unit:gcc:tsan

00:02:10

passed #798789
amd64 linux
unit:gcc:tumbleweed:amd64

00:00:40

passed #798791
amd64 linux
unit:gcc:xenial:amd64

00:00:43

 
  System
failed #798816
amd64 linux
system:clang:asan

00:18:36

failed #798820
amd64 linux
system:clang:buster:amd64

00:16:32

failed #798822
amd64 libvirt
system:clang:freebsd11.3:amd64

00:18:58

failed #798823
amd64 libvirt
system:clang:freebsd12.1:amd64

00:18:35

failed #798818
amd64 linux allowed to fail
system:clang:tsan

00:06:13

failed #798802
amd64 linux
system:gcc:alpine3.11:amd64

00:17:20

failed #798815
amd64 linux
system:gcc:asan

00:18:20

failed #798814
amd64 linux
system:gcc:bionic:amd64

00:17:13

failed #798807
amd64 linux
system:gcc:buster:amd64

00:17:07

failed #798803
amd64 linux
system:gcc:centos6:amd64

00:17:30

failed #798804
amd64 linux
system:gcc:centos7:amd64

00:17:18

failed #798805
amd64 linux
system:gcc:centos8:amd64

00:17:14

failed #798812
amd64 linux
system:gcc:fedora31:amd64

00:17:33

failed #798819
amd64 linux
system:gcc:mutexatomics

00:17:11

failed #798821
amd64 linux
system:gcc:pkcs11

00:17:22

failed #798808
amd64 linux
system:gcc:sid:amd64

00:17:26

failed #798809
arm64 linux
system:gcc:sid:arm64

00:26:47

failed #798810
i386 linux
system:gcc:sid:i386

00:17:08

failed #798806
amd64 linux
system:gcc:stretch:amd64

00:16:42

failed #798817
amd64 linux allowed to fail
system:gcc:tsan

00:20:07

failed #798811
amd64 linux
system:gcc:tumbleweed:amd64

00:17:08

failed #798813
amd64 linux
system:gcc:xenial:amd64

00:16:40

 
  Docs
passed #798824
amd64 linux
docs

00:00:25

 
  Postcheck
passed #798826
amd64 linux
cppcheck

00:00:26

passed #798825
amd64 linux
scan-build

00:09:26

 
Name Stage Failure
failed
system:gcc:tsan System
Running after script...
$ find bin -name 'tsan.*' -exec python3 util/parse_tsan.py {} \;
Uploading artifacts for failed job
Uploading artifacts...
bin/tests/system/*/tsan.*: found 18 matching files

bin/tests/system/*/*/tsan.*: found 259 matching files

tsan/: found 244 matching files

Uploading artifacts to coordinator... ok
id=798817 responseStatus=201 Created token=3tQjr38o
ERROR: Job failed: exit code 1
failed
system:clang:asan System
I:      sfcache
I: xfer
make: *** [Makefile:441: test] Error 1
Running after_script
Uploading artifacts for failed job
Uploading artifacts...
untracked: found 5767 files

Uploading artifacts to coordinator... ok
id=798816 responseStatus=201 Created token=FHzQaczT
ERROR: Job failed: exit code 1
failed
system:gcc:asan System
I:Core dumps were found for the following system tests:
I: legacy
make: *** [Makefile:441: test] Error 1
Running after_script
Uploading artifacts for failed job
Uploading artifacts...
untracked: found 5828 files

Uploading artifacts to coordinator... ok
id=798815 responseStatus=201 Created token=pTeW3Dsn
ERROR: Job failed: exit code 1
failed
system:gcc:pkcs11 System
I:      sfcache
I: xfer
make: *** [Makefile:441: test] Error 1
Running after_script
Uploading artifacts for failed job
Uploading artifacts...
untracked: found 5766 files

Uploading artifacts to coordinator... ok
id=798821 responseStatus=201 Created token=cmf4eFT_
ERROR: Job failed: exit code 1
failed
system:gcc:mutexatomics System
I:Core dumps were found for the following system tests:
I: legacy
make: *** [Makefile:441: test] Error 1
Running after_script
Uploading artifacts for failed job
Uploading artifacts...
untracked: found 5814 files

Uploading artifacts to coordinator... ok
id=798819 responseStatus=201 Created token=xRWCxND8
ERROR: Job failed: exit code 1
failed
system:clang:buster:amd64 System
I:      sfcache
I: xfer
make: *** [Makefile:441: test] Error 1
Running after_script
Uploading artifacts for failed job
Uploading artifacts...
untracked: found 5742 files

Uploading artifacts to coordinator... ok
id=798820 responseStatus=201 Created token=zVDtQ4-d
ERROR: Job failed: exit code 1
failed
system:gcc:fedora31:amd64 System
I:      sfcache
I: xfer
make: *** [Makefile:441: test] Error 1
Running after_script
Uploading artifacts for failed job
Uploading artifacts...
untracked: found 5780 files

Uploading artifacts to coordinator... ok
id=798812 responseStatus=201 Created token=zJnHpMua
ERROR: Job failed: exit code 1
failed
system:gcc:bionic:amd64 System
I:      xfer
make: *** [test] Error 1
Makefile:439: recipe for target 'test' failed
Running after_script
Uploading artifacts for failed job
Uploading artifacts...
untracked: found 5746 files

Uploading artifacts to coordinator... ok
id=798814 responseStatus=201 Created token=PcwtYsNW
ERROR: Job failed: exit code 1
failed
system:gcc:sid:arm64 System
I:      sfcache
I: xfer
I:Core dumps were found for the following system tests:
I: legacy
make: *** [Makefile:441: test] Error 1
Uploading artifacts...
untracked: found 5814 files
Uploading artifacts to coordinator... ok
id=798809 responseStatus=201 Created token=3P1A-1md
ERROR: Job failed: exit code 1
failed
system:gcc:xenial:amd64 System
I:      xfer
make: *** [test] Error 1
Makefile:439: recipe for target 'test' failed
Running after_script
Uploading artifacts for failed job
Uploading artifacts...
untracked: found 5763 files

Uploading artifacts to coordinator... ok
id=798813 responseStatus=201 Created token=KwFP_Xjy
ERROR: Job failed: exit code 1
failed
system:clang:freebsd12.1:amd64 System

make: stopped in /builds/isc-projects/bind9/bin/tests/system
Running after_script
Uploading artifacts for failed job
Uploading artifacts...
Runtime platform
arch=amd64 os=freebsd pid=28137 revision=4c96e5ad version=12.9.0
untracked: found 5784 files

Uploading artifacts to coordinator... ok
id=798823 responseStatus=201 Created token=6SzLLqyY
ERROR: Job failed: exit status 1
failed
system:clang:freebsd11.3:amd64 System

make: stopped in /builds/isc-projects/bind9/bin/tests/system
Running after_script
Uploading artifacts for failed job
Uploading artifacts...
Runtime platform
arch=amd64 os=freebsd pid=25092 revision=4c96e5ad version=12.9.0
untracked: found 5739 files

Uploading artifacts to coordinator... ok
id=798822 responseStatus=201 Created token=cLUwmB4k
ERROR: Job failed: exit status 1
failed
system:gcc:tumbleweed:amd64 System
I:      sfcache
I: xfer
make: *** [Makefile:441: test] Error 1
Running after_script
Uploading artifacts for failed job
Uploading artifacts...
untracked: found 5734 files

Uploading artifacts to coordinator... ok
id=798811 responseStatus=201 Created token=xAs7SAG9
ERROR: Job failed: exit code 1
failed
system:gcc:sid:amd64 System
I:      sfcache
I: xfer
make: *** [Makefile:441: test] Error 1
Running after_script
Uploading artifacts for failed job
Uploading artifacts...
untracked: found 5758 files

Uploading artifacts to coordinator... ok
id=798808 responseStatus=201 Created token=s5nbf6bD
ERROR: Job failed: exit code 1
failed
system:gcc:sid:i386 System
I:      sfcache
I: xfer
make: *** [Makefile:441: test] Error 1
Running after_script
Uploading artifacts for failed job
Uploading artifacts...
untracked: found 5714 files

Uploading artifacts to coordinator... ok
id=798810 responseStatus=201 Created token=d6s3-msK
ERROR: Job failed: exit code 1
failed
system:gcc:centos6:amd64 System
I:      sfcache
I: xfer
make: *** [test] Error 1
Running after_script
Uploading artifacts for failed job
Uploading artifacts...
untracked: found 5775 files

Uploading artifacts to coordinator... ok
id=798803 responseStatus=201 Created token=XyPLaJG4
ERROR: Job failed: exit code 1
failed
system:gcc:buster:amd64 System
I:      sfcache
I: xfer
make: *** [Makefile:441: test] Error 1
Running after_script
Uploading artifacts for failed job
Uploading artifacts...
untracked: found 5743 files

Uploading artifacts to coordinator... ok
id=798807 responseStatus=201 Created token=rCxTgFQ_
ERROR: Job failed: exit code 1
failed
system:gcc:centos7:amd64 System
I:      sfcache
I: xfer
make: *** [test] Error 1
Running after_script
Uploading artifacts for failed job
Uploading artifacts...
untracked: found 5781 files

Uploading artifacts to coordinator... ok
id=798804 responseStatus=201 Created token=yQVU9Jtp
ERROR: Job failed: exit code 1
failed
system:gcc:centos8:amd64 System
I:      sfcache
I: xfer
make: *** [Makefile:441: test] Error 1
Running after_script
Uploading artifacts for failed job
Uploading artifacts...
untracked: found 5775 files

Uploading artifacts to coordinator... ok
id=798805 responseStatus=201 Created token=kg-jPHTx
ERROR: Job failed: exit code 1
failed
system:gcc:alpine3.11:amd64 System
I:      sfcache
I: xfer
make: *** [Makefile:441: test] Error 1
Running after_script
Uploading artifacts for failed job
Uploading artifacts...
untracked: found 5780 files

Uploading artifacts to coordinator... ok
id=798802 responseStatus=201 Created token=BtkpVxEU
ERROR: Job failed: exit code 1
failed
system:gcc:stretch:amd64 System
I:      xfer
Makefile:439: recipe for target 'test' failed
make: *** [test] Error 1
Running after_script
Uploading artifacts for failed job
Uploading artifacts...
untracked: found 5732 files

Uploading artifacts to coordinator... ok
id=798806 responseStatus=201 Created token=Wy92ZsjE
ERROR: Job failed: exit code 1
failed
system:clang:tsan System
Running after script...
$ find bin -name 'tsan.*' -exec python3 util/parse_tsan.py {} \;
Uploading artifacts for failed job
Uploading artifacts...
bin/tests/system/*/tsan.*: found 640 matching files

bin/tests/system/*/*/tsan.*: found 550 matching files

tsan/: found 1 matching files

Uploading artifacts to coordinator... ok
id=798818 responseStatus=201 Created token=rshzdd1w
ERROR: Job failed: exit code 1
failed
unit:gcc:tsan Unit
Uploading artifacts for failed job
Uploading artifacts...
WARNING: lib/*/tests/tsan.*: no matching files
WARNING: tsan/: no matching files
kyua.log: found 1 matching files

kyua.results: found 1 matching files

kyua_html/: found 69 matching files

Uploading artifacts to coordinator... ok
id=798795 responseStatus=201 Created token=18MT9Cx7
ERROR: Job failed: exit code 1
failed
unit:clang:tsan Unit
Uploading artifacts for failed job
Uploading artifacts...
WARNING: lib/*/tests/tsan.*: no matching files
WARNING: tsan/: no matching files
kyua.log: found 1 matching files

kyua.results: found 1 matching files

kyua_html/: found 69 matching files

Uploading artifacts to coordinator... ok
id=798796 responseStatus=201 Created token=yxBcKbFZ
ERROR: Job failed: exit code 1