fixup! gen should be linked against libuv

81 jobs for !3436 with 1799-gen-shouldn-t-be-linking-against-libuv in 24 minutes and 26 seconds (queued for 5 seconds)
latest detached
Status Job ID Name Coverage
  Precheck
passed #847583
amd64 linux
autoreconf

00:00:18

passed #847585
amd64 linux
clang-format

00:00:24

passed #847586
amd64 linux
coccinelle

00:03:51

passed #847584
amd64 linux
misc

00:00:18

 
  Build
passed #847602
amd64 linux
clang:asan

00:01:41

passed #847606
amd64 linux
clang:buster:amd64

00:01:18

passed #847608
amd64 libvirt
clang:freebsd11.3:amd64

00:01:51

passed #847609
amd64 libvirt
clang:freebsd12.1:amd64

00:01:45

passed #847610
amd64 libvirt
clang:openbsd6.6:amd64

00:05:33

passed #847604
amd64 linux
clang:tsan

00:01:48

passed #847587
amd64 linux
gcc:alpine3.11:amd64

00:01:46

failed #847601
amd64 linux
gcc:asan

00:02:51

passed #847600
amd64 linux
gcc:bionic:amd64

00:01:07

passed #847592
amd64 linux
gcc:buster:amd64

00:01:40

passed #847588
amd64 linux
gcc:centos6:amd64

00:01:34

passed #847589
amd64 linux
gcc:centos7:amd64

00:01:50

passed #847590
amd64 linux
gcc:centos8:amd64

00:01:38

passed #847598
amd64 linux
gcc:fedora31:amd64

00:02:02

passed #847605
amd64 linux
gcc:mutexatomics

00:01:05

passed #847594
amd64 linux
gcc:out-of-tree

00:01:07

passed #847607
amd64 linux
gcc:pkcs11

00:01:12

passed #847593
amd64 linux
gcc:sid:amd64

00:02:19

passed #847595
arm64 linux
gcc:sid:arm64

00:08:48

passed #847596
i386 linux
gcc:sid:i386

00:00:55

passed #847591
amd64 linux
gcc:stretch:amd64

00:00:59

failed #847603
amd64 linux
gcc:tsan

00:01:44

passed #847597
amd64 linux
gcc:tumbleweed:amd64

00:01:46

passed #847599
amd64 linux
gcc:xenial:amd64

00:01:00

passed #847612
amd64 windows
msvc:windows:amd64

00:02:32

passed #847611
amd64 linux
nolibtool:sid:amd64

00:01:47

 
  Unit
skipped #847627
amd64 linux
unit:clang:asan
passed #847631
amd64 linux
unit:clang:buster:amd64

00:00:35

passed #847633
amd64 libvirt
unit:clang:freebsd11.3:amd64

00:01:02

passed #847634
amd64 libvirt
unit:clang:freebsd12.1:amd64

00:01:00

failed #847629
amd64 linux allowed to fail
unit:clang:tsan

00:00:21

passed #847613
amd64 linux
unit:gcc:alpine3.11:amd64

00:00:43

skipped #847626
amd64 linux
unit:gcc:asan
passed #847625
amd64 linux
unit:gcc:bionic:amd64

00:00:42

passed #847618
amd64 linux
unit:gcc:buster:amd64

00:00:38

passed #847614
amd64 linux
unit:gcc:centos6:amd64

00:00:40

passed #847615
amd64 linux
unit:gcc:centos7:amd64

00:00:38

passed #847616
amd64 linux
unit:gcc:centos8:amd64

00:00:41

passed #847623
amd64 linux
unit:gcc:fedora31:amd64

00:00:42

passed #847630
amd64 linux
unit:gcc:mutexatomics

00:00:40

passed #847632
amd64 linux
unit:gcc:pkcs11

00:00:37

passed #847619
amd64 linux
unit:gcc:sid:amd64

00:00:41

passed #847620
arm64 linux
unit:gcc:sid:arm64

00:00:58

passed #847621
i386 linux
unit:gcc:sid:i386

00:00:44

passed #847617
amd64 linux
unit:gcc:stretch:amd64

00:00:39

skipped #847628
amd64 linux allowed to fail
unit:gcc:tsan
passed #847622
amd64 linux
unit:gcc:tumbleweed:amd64

00:00:39

passed #847624
amd64 linux
unit:gcc:xenial:amd64

00:00:43

passed #847635
amd64 linux
unit:nolibtool:sid:amd64

00:00:52

 
  System
skipped #847650
amd64 linux
system:clang:asan
passed #847654
amd64 linux
system:clang:buster:amd64

00:09:45

passed #847656
amd64 libvirt
system:clang:freebsd11.3:amd64

00:12:36

failed #847657
amd64 libvirt
system:clang:freebsd12.1:amd64

00:12:31

failed #847652
amd64 linux allowed to fail
system:clang:tsan

00:06:28

passed #847636
amd64 linux
system:gcc:alpine3.11:amd64

00:11:07

skipped #847649
amd64 linux
system:gcc:asan
passed #847648
amd64 linux
system:gcc:bionic:amd64

00:09:42

passed #847641
amd64 linux
system:gcc:buster:amd64

00:09:43

passed #847637
amd64 linux
system:gcc:centos6:amd64

00:10:06

passed #847638
amd64 linux
system:gcc:centos7:amd64

00:10:12

passed #847639
amd64 linux
system:gcc:centos8:amd64

00:10:25

passed #847646
amd64 linux
system:gcc:fedora31:amd64

00:10:32

passed #847653
amd64 linux
system:gcc:mutexatomics

00:09:31

passed #847655
amd64 linux
system:gcc:pkcs11

00:10:28

passed #847642
amd64 linux
system:gcc:sid:amd64

00:10:10

passed #847643
arm64 linux
system:gcc:sid:arm64

00:11:10

passed #847644
i386 linux
system:gcc:sid:i386

00:10:19

passed #847640
amd64 linux
system:gcc:stretch:amd64

00:09:45

skipped #847651
amd64 linux allowed to fail
system:gcc:tsan
passed #847645
amd64 linux
system:gcc:tumbleweed:amd64

00:10:20

passed #847647
amd64 linux
system:gcc:xenial:amd64

00:09:05

passed #847658
amd64 linux
system:nolibtool:sid:amd64

00:10:55

 
  Docs
passed #847659
amd64 linux
docs

00:00:27

 
  Postcheck
passed #847663
amd64 linux
cppcheck

00:00:24

passed #847660
amd64 linux
flake8

00:02:24

failed #847661
amd64 linux
pylint

00:02:26

passed #847662
amd64 linux
scan-build

00:09:12

 
Name Stage Failure
failed
system:clang:freebsd12.1:amd64 System

make: stopped in /builds/isc-projects/bind9/bin/tests/system
Running after_script
Uploading artifacts for failed job
Uploading artifacts...
Runtime platform
arch=amd64 os=freebsd pid=30017 revision=4c96e5ad version=12.9.0
untracked: found 1371 files

Uploading artifacts to coordinator... ok
id=847657 responseStatus=201 Created token=H2d7mwxm
ERROR: Job failed: exit status 1
failed
pylint Postcheck
util/parse_tsan.py:83:16: C0103: Constant name "dname" doesn't conform to UPPER_CASE naming style (invalid-name)
util/parse_tsan.py:87:16: C0103: Constant name "fname" doesn't conform to UPPER_CASE naming style (invalid-name)

-----------------------------------
Your code has been rated at 9.93/10

Running after_script
Uploading artifacts for failed job
ERROR: Job failed: exit code 1
failed
system:clang:tsan System
Running after script...
$ find bin -name 'tsan.*' -exec python3 util/parse_tsan.py {} \;
Uploading artifacts for failed job
Uploading artifacts...
bin/tests/system/*/tsan.*: found 633 matching files

bin/tests/system/*/*/tsan.*: found 552 matching files

tsan/: found 1 matching files

Uploading artifacts to coordinator... ok
id=847652 responseStatus=201 Created token=M1e_sMnA
ERROR: Job failed: exit code 1
failed
gcc:asan Build
make[2]: Target 'all' not remade because of errors.
make[1]: *** [Makefile:84: subdirs] Error 1
make[1]: Target 'all' not remade because of errors.
make[1]: Leaving directory '/builds/isc-projects/bind9/lib'
make: *** [Makefile:87: subdirs] Error 1
make: Target 'all' not remade because of errors.
Running after_script
Uploading artifacts for failed job
ERROR: Job failed: exit code 1
failed
unit:clang:tsan Unit
Uploading artifacts for failed job
Uploading artifacts...
WARNING: lib/*/tests/tsan.*: no matching files
WARNING: tsan/: no matching files
kyua.log: found 1 matching files

kyua.results: found 1 matching files

kyua_html/: found 70 matching files

Uploading artifacts to coordinator... ok
id=847629 responseStatus=201 Created token=A-D6xa3X
ERROR: Job failed: exit code 1
failed
gcc:tsan Build
make[2]: Target 'all' not remade because of errors.
make[1]: Leaving directory '/builds/isc-projects/bind9/lib'
make[1]: *** [Makefile:84: subdirs] Error 1
make[1]: Target 'all' not remade because of errors.
make: *** [Makefile:87: subdirs] Error 1
make: Target 'all' not remade because of errors.
Running after_script
Uploading artifacts for failed job
ERROR: Job failed: exit code 1