Set detect_odr_violation=0 in asan options in CI

77 jobs for !3466 with wpk-disable-detect_odr_violation in 12 minutes and 37 seconds (queued for 51 minutes and 7 seconds)
detached
Status Job ID Name Coverage
  Autoconf
passed #859171
amd64 linux
autoreconf

00:00:23

 
  Precheck
passed #859173
amd64 linux
clang-format

00:00:23

passed #859174
amd64 linux
coccinelle

00:03:24

passed #859172
amd64 linux
misc

00:00:16

 
  Build
failed #859190
amd64 linux
clang:asan

00:02:35

failed #859194
amd64 linux
clang:buster:amd64

00:02:58

failed #859196
amd64 libvirt
clang:freebsd11.3:amd64

00:01:00

failed #859197
amd64 libvirt
clang:freebsd12.1:amd64

00:00:57

failed #859198
amd64 libvirt
clang:openbsd6.6:amd64

00:03:20

failed #859192
amd64 linux
clang:tsan

00:02:09

failed #859175
amd64 linux
gcc:alpine3.11:amd64

00:03:04

failed #859189
amd64 linux
gcc:asan

00:03:24

failed #859188
amd64 linux
gcc:bionic:amd64

00:00:33

failed #859180
amd64 linux
gcc:buster:amd64

00:01:56

failed #859176
amd64 linux
gcc:centos6:amd64

00:00:39

failed #859177
amd64 linux
gcc:centos7:amd64

00:00:46

failed #859178
amd64 linux
gcc:centos8:amd64

00:06:54

failed #859186
amd64 linux
gcc:fedora31:amd64

00:02:16

failed #859193
amd64 linux
gcc:mutexatomics

00:02:52

failed #859182
amd64 linux
gcc:out-of-tree

00:01:50

failed #859195
amd64 linux
gcc:pkcs11

00:01:41

failed #859181
amd64 linux
gcc:sid:amd64

00:00:42

failed #859183
arm64 linux
gcc:sid:arm64

00:01:04

failed #859184
i386 linux
gcc:sid:i386

00:00:38

failed #859179
amd64 linux
gcc:stretch:amd64

00:00:41

failed #859191
amd64 linux
gcc:tsan

00:02:47

failed #859185
amd64 linux
gcc:tumbleweed:amd64

00:00:44

failed #859187
amd64 linux
gcc:xenial:amd64

00:00:38

 
  Unit
skipped #859213
amd64 linux
unit:clang:asan
skipped #859217
amd64 linux
unit:clang:buster:amd64
skipped #859219
amd64 libvirt
unit:clang:freebsd11.3:amd64
skipped #859220
amd64 libvirt
unit:clang:freebsd12.1:amd64
skipped #859215
amd64 linux allowed to fail
unit:clang:tsan
skipped #859199
amd64 linux
unit:gcc:alpine3.11:amd64
skipped #859212
amd64 linux
unit:gcc:asan
skipped #859211
amd64 linux
unit:gcc:bionic:amd64
skipped #859204
amd64 linux
unit:gcc:buster:amd64
skipped #859200
amd64 linux
unit:gcc:centos6:amd64
skipped #859201
amd64 linux
unit:gcc:centos7:amd64
skipped #859202
amd64 linux
unit:gcc:centos8:amd64
skipped #859209
amd64 linux
unit:gcc:fedora31:amd64
skipped #859216
amd64 linux
unit:gcc:mutexatomics
skipped #859218
amd64 linux
unit:gcc:pkcs11
skipped #859205
amd64 linux
unit:gcc:sid:amd64
skipped #859206
arm64 linux
unit:gcc:sid:arm64
skipped #859207
i386 linux
unit:gcc:sid:i386
skipped #859203
amd64 linux
unit:gcc:stretch:amd64
skipped #859214
amd64 linux allowed to fail
unit:gcc:tsan
skipped #859208
amd64 linux
unit:gcc:tumbleweed:amd64
skipped #859210
amd64 linux
unit:gcc:xenial:amd64
 
  System
skipped #859235
amd64 linux
system:clang:asan
skipped #859239
amd64 linux
system:clang:buster:amd64
skipped #859241
amd64 libvirt
system:clang:freebsd11.3:amd64
skipped #859242
amd64 libvirt
system:clang:freebsd12.1:amd64
skipped #859237
amd64 linux allowed to fail
system:clang:tsan
skipped #859221
amd64 linux
system:gcc:alpine3.11:amd64
skipped #859234
amd64 linux
system:gcc:asan
skipped #859233
amd64 linux
system:gcc:bionic:amd64
skipped #859226
amd64 linux
system:gcc:buster:amd64
skipped #859222
amd64 linux
system:gcc:centos6:amd64
skipped #859223
amd64 linux
system:gcc:centos7:amd64
skipped #859224
amd64 linux
system:gcc:centos8:amd64
skipped #859231
amd64 linux
system:gcc:fedora31:amd64
skipped #859238
amd64 linux
system:gcc:mutexatomics
skipped #859240
amd64 linux
system:gcc:pkcs11
skipped #859227
amd64 linux
system:gcc:sid:amd64
skipped #859228
arm64 linux
system:gcc:sid:arm64
skipped #859229
i386 linux
system:gcc:sid:i386
skipped #859225
amd64 linux
system:gcc:stretch:amd64
skipped #859236
amd64 linux allowed to fail
system:gcc:tsan
skipped #859230
amd64 linux
system:gcc:tumbleweed:amd64
skipped #859232
amd64 linux
system:gcc:xenial:amd64
 
  Docs
failed #859243
amd64 linux allowed to fail
docs

00:00:19

 
  Postcheck
passed #859247
amd64 linux
cppcheck

00:00:54

passed #859244
amd64 linux
flake8

00:01:36

passed #859245
amd64 linux
pylint

00:02:56

passed #859246
amd64 linux
scan-build

00:04:08

 
Name Stage Failure
failed
clang:buster:amd64 Build
make[2]: Leaving directory '/builds/isc-projects/bind9/bin'
make[1]: Leaving directory '/builds/isc-projects/bind9'
make[2]: *** [Makefile:444: all-recursive] Error 1
make[2]: Target 'all' not remade because of errors.
make[1]: *** [Makefile:618: all-recursive] Error 1
make: *** [Makefile:524: all] Error 2
Running after_script
Uploading artifacts for failed job
ERROR: Job failed: exit code 1
failed
gcc:centos8:amd64 Build
make[2]: *** [Makefile:444: all-recursive] Error 1
make[2]: Target 'all' not remade because of errors.
make[2]: Leaving directory '/builds/isc-projects/bind9/bin'
make[1]: Leaving directory '/builds/isc-projects/bind9'
make[1]: *** [Makefile:618: all-recursive] Error 1
make: *** [Makefile:524: all] Error 2
Running after_script
Uploading artifacts for failed job
ERROR: Job failed: exit code 1
failed
gcc:mutexatomics Build
make[2]: *** [Makefile:444: all-recursive] Error 1
make[2]: Target 'all' not remade because of errors.
make[2]: Leaving directory '/builds/isc-projects/bind9/bin'
make[1]: *** [Makefile:618: all-recursive] Error 1
make[1]: Leaving directory '/builds/isc-projects/bind9'
make: *** [Makefile:524: all] Error 2
Running after_script
Uploading artifacts for failed job
ERROR: Job failed: exit code 1
failed
gcc:pkcs11 Build
make[2]: Leaving directory '/builds/isc-projects/bind9/bin'
make[2]: *** [Makefile:444: all-recursive] Error 1
make[2]: Target 'all' not remade because of errors.
make[1]: *** [Makefile:618: all-recursive] Error 1
make[1]: Leaving directory '/builds/isc-projects/bind9'
make: *** [Makefile:524: all] Error 2
Running after_script
Uploading artifacts for failed job
ERROR: Job failed: exit code 1
failed
gcc:asan Build
make[2]: Leaving directory '/builds/isc-projects/bind9/bin'
make[2]: *** [Makefile:444: all-recursive] Error 1
make[2]: Target 'all' not remade because of errors.
make[1]: *** [Makefile:618: all-recursive] Error 1
make[1]: Leaving directory '/builds/isc-projects/bind9'
make: *** [Makefile:524: all] Error 2
Running after_script
Uploading artifacts for failed job
ERROR: Job failed: exit code 1
failed
gcc:tsan Build
make[2]: *** [Makefile:444: all-recursive] Error 1
make[2]: Target 'all' not remade because of errors.
make[2]: Leaving directory '/builds/isc-projects/bind9/bin'
make[1]: *** [Makefile:618: all-recursive] Error 1
make[1]: Leaving directory '/builds/isc-projects/bind9'
make: *** [Makefile:524: all] Error 2
Running after_script
Uploading artifacts for failed job
ERROR: Job failed: exit code 1
failed
docs Docs
For more detail, use --enable-full-report.
===============================================================================
$ make -C doc/misc docbook
make: *** No rule to make target 'docbook'. Stop.
make: Entering directory '/builds/isc-projects/bind9/doc/misc'
make: Leaving directory '/builds/isc-projects/bind9/doc/misc'
Running after_script
Uploading artifacts for failed job
ERROR: Job failed: exit code 1
failed
clang:asan Build
make[2]: *** [Makefile:444: all-recursive] Error 1
make[2]: Target 'all' not remade because of errors.
make[2]: Leaving directory '/builds/isc-projects/bind9/bin'
make[1]: *** [Makefile:618: all-recursive] Error 1
make[1]: Leaving directory '/builds/isc-projects/bind9'
make: *** [Makefile:524: all] Error 2
Running after_script
Uploading artifacts for failed job
ERROR: Job failed: exit code 1
failed
clang:tsan Build
make[2]: Leaving directory '/builds/isc-projects/bind9/bin'
make[2]: *** [Makefile:444: all-recursive] Error 1
make[2]: Target 'all' not remade because of errors.
make[1]: Leaving directory '/builds/isc-projects/bind9'
make[1]: *** [Makefile:618: all-recursive] Error 1
make: *** [Makefile:524: all] Error 2
Running after_script
Uploading artifacts for failed job
ERROR: Job failed: exit code 1
failed
gcc:fedora31:amd64 Build
make[2]: Leaving directory '/builds/isc-projects/bind9/bin'
make[2]: *** [Makefile:444: all-recursive] Error 1
make[2]: Target 'all' not remade because of errors.
make[1]: *** [Makefile:618: all-recursive] Error 1
make[1]: Leaving directory '/builds/isc-projects/bind9'
make: *** [Makefile:524: all] Error 2
Running after_script
Uploading artifacts for failed job
ERROR: Job failed: exit code 1
failed
clang:openbsd6.6:amd64 Build
Errors while building
*** Error 1 in target 'all-recursive', line 643 of Makefile (continuing)
Error target(s) unaccounted for: all-recursive
Errors while building
*** Error 2 in target 'all', line 524 of Makefile (continuing)
Error target(s) unaccounted for: all
Running after_script
Uploading artifacts for failed job
ERROR: Job failed: exit status 1
failed
gcc:bionic:amd64 Build
make[2]: Target 'all' not remade because of errors.
Makefile:618: recipe for target 'all-recursive' failed
make[1]: Leaving directory '/builds/isc-projects/bind9'
make[1]: *** [all-recursive] Error 1
Makefile:524: recipe for target 'all' failed
make: *** [all] Error 2
Running after_script
Uploading artifacts for failed job
ERROR: Job failed: exit code 1
failed
gcc:xenial:amd64 Build
make[2]: Leaving directory '/builds/isc-projects/bind9/bin'
make[1]: *** [all-recursive] Error 1
Makefile:618: recipe for target 'all-recursive' failed
make[1]: Leaving directory '/builds/isc-projects/bind9'
Makefile:524: recipe for target 'all' failed
make: *** [all] Error 2
Running after_script
Uploading artifacts for failed job
ERROR: Job failed: exit code 1
failed
gcc:out-of-tree Build
make[2]: Leaving directory '/builds/isc-projects/bind9/workspace/bin'
make[2]: *** [Makefile:444: all-recursive] Error 1
make[2]: Target 'all' not remade because of errors.
make[1]: *** [Makefile:618: all-recursive] Error 1
make[1]: Leaving directory '/builds/isc-projects/bind9/workspace'
make: *** [Makefile:524: all] Error 2
Running after_script
Uploading artifacts for failed job
ERROR: Job failed: exit code 1
failed
gcc:tumbleweed:amd64 Build
make[2]: Leaving directory '/builds/isc-projects/bind9/bin'
make[2]: *** [Makefile:444: all-recursive] Error 1
make[2]: Target 'all' not remade because of errors.
make[1]: *** [Makefile:618: all-recursive] Error 1
make[1]: Leaving directory '/builds/isc-projects/bind9'
make: *** [Makefile:524: all] Error 2
Running after_script
Uploading artifacts for failed job
ERROR: Job failed: exit code 1
failed
gcc:sid:i386 Build
make[2]: Leaving directory '/builds/isc-projects/bind9/bin'
make[2]: *** [Makefile:444: all-recursive] Error 1
make[2]: Target 'all' not remade because of errors.
make[1]: Leaving directory '/builds/isc-projects/bind9'
make[1]: *** [Makefile:618: all-recursive] Error 1
make: *** [Makefile:524: all] Error 2
Running after_script
Uploading artifacts for failed job
ERROR: Job failed: exit code 1
failed
gcc:buster:amd64 Build
make[2]: Leaving directory '/builds/isc-projects/bind9/bin'
make[2]: *** [Makefile:444: all-recursive] Error 1
make[2]: Target 'all' not remade because of errors.
make[1]: Leaving directory '/builds/isc-projects/bind9'
make[1]: *** [Makefile:618: all-recursive] Error 1
make: *** [Makefile:524: all] Error 2
Running after_script
Uploading artifacts for failed job
ERROR: Job failed: exit code 1
failed
gcc:alpine3.11:amd64 Build
make[2]: Leaving directory '/builds/isc-projects/bind9/bin'
make[2]: *** [Makefile:444: all-recursive] Error 1
make[2]: Target 'all' not remade because of errors.
make[1]: *** [Makefile:618: all-recursive] Error 1
make[1]: Leaving directory '/builds/isc-projects/bind9'
make: *** [Makefile:524: all] Error 2
Running after_script
Uploading artifacts for failed job
ERROR: Job failed: exit code 1
failed
gcc:sid:amd64 Build
make[2]: *** [Makefile:444: all-recursive] Error 1
make[2]: Target 'all' not remade because of errors.
make[2]: Leaving directory '/builds/isc-projects/bind9/bin'
make[1]: Leaving directory '/builds/isc-projects/bind9'
make[1]: *** [Makefile:618: all-recursive] Error 1
make: *** [Makefile:524: all] Error 2
Running after_script
Uploading artifacts for failed job
ERROR: Job failed: exit code 1
failed
clang:freebsd12.1:amd64 Build
*** [all-recursive] Error code 1

make[1]: stopped in /builds/isc-projects/bind9
*** [all] Error code 1

make: stopped in /builds/isc-projects/bind9
Running after_script
Uploading artifacts for failed job
ERROR: Job failed: exit status 1
failed
gcc:stretch:amd64 Build
make[2]: Target 'all' not remade because of errors.
Makefile:618: recipe for target 'all-recursive' failed
make[1]: Leaving directory '/builds/isc-projects/bind9'
make[1]: *** [all-recursive] Error 1
Makefile:524: recipe for target 'all' failed
make: *** [all] Error 2
Running after_script
Uploading artifacts for failed job
ERROR: Job failed: exit code 1
failed
gcc:centos7:amd64 Build
make[2]: *** [all-recursive] Error 1
make[2]: Target `all' not remade because of errors.
make[2]: Leaving directory `/builds/isc-projects/bind9/bin'
make[1]: *** [all-recursive] Error 1
make[1]: Leaving directory `/builds/isc-projects/bind9'
make: *** [all] Error 2
Running after_script
Uploading artifacts for failed job
ERROR: Job failed: exit code 1
failed
gcc:centos6:amd64 Build
make[2]: Leaving directory `/builds/isc-projects/bind9/bin'
make[2]: *** [all-recursive] Error 1
make[2]: Target `all' not remade because of errors.
make[1]: *** [all-recursive] Error 1
make[1]: Leaving directory `/builds/isc-projects/bind9'
make: *** [all] Error 2
Running after_script
Uploading artifacts for failed job
ERROR: Job failed: exit code 1
failed
clang:freebsd11.3:amd64 Build
*** [all-recursive] Error code 1

make[1]: stopped in /builds/isc-projects/bind9
*** [all] Error code 1

make: stopped in /builds/isc-projects/bind9
Running after_script
Uploading artifacts for failed job
ERROR: Job failed: exit status 1
failed
gcc:sid:arm64 Build
make[2]: *** [Makefile:444: all-recursive] Error 1
make[2]: Target 'all' not remade because of errors.
make[2]: Leaving directory '/builds/isc-projects/bind9/bin'
make[1]: Leaving directory '/builds/isc-projects/bind9'
make[1]: *** [Makefile:618: all-recursive] Error 1
make: *** [Makefile:524: all] Error 2
Running after_script
Uploading artifacts for failed job
ERROR: Job failed: exit code 1