fixup! fixup! fixup! fixup! Replace CentOS with Oracle Linux

latest
Status Job ID Name Coverage
  Images
manual #1380089
amd64 linux docker manual
alpine:3.12:amd64:docker
manual #1380094
amd64 linux docker manual
centos:7:amd64:packer
manual #1380095
amd64 linux docker manual
centos:8:amd64:packer
manual #1380099
amd64 linux docker manual
debian:buster:amd64:docker
manual #1380100
amd64 linux docker manual
debian:sid:amd64:docker
manual #1380098
amd64 linux docker manual
debian:stretch:amd64:docker
manual #1380096
amd64 linux docker manual
fedora:33:amd64:docker
manual #1380097
aarch64 linux-stress docker manual
fedora:33:arm64:docker
manual #1380106
amd64 linux docker manual
freebsd:11.4:amd64:packer
manual #1380107
amd64 linux docker manual
freebsd:12.2:amd64:packer
manual #1380108
amd64 linux docker manual
openbsd:6.8:amd64:packer
failed #1380091
amd64 linux docker manual
oraclelinux:6:amd64:docker

00:03:34

failed #1380090
i386 linux docker manual
oraclelinux:6:i386:docker

00:00:45

failed #1380092
amd64 linux docker manual
oraclelinux:7:amd64:docker

00:04:08

failed #1380093
amd64 linux docker manual
oraclelinux:8:amd64:docker

00:01:05

manual #1380104
amd64 linux docker manual
packager:rpm:docker
manual #1380103
amd64 linux docker manual
tumbleweed:latest:amd64:docker
manual #1380102
amd64 linux docker manual
ubuntu:focal:amd64:docker
manual #1380101
amd64 linux docker manual
ubuntu:xenial:amd64:docker
manual #1380105
amd64 linux docker manual
website:rsync_ssh_curl:docker
 
Name Stage Failure
failed
oraclelinux:7:amd64:docker Images
checking for LUA... no
checking for LUA... no
checking for lua-config... no
configure: error: lua (5.1 or newer) is required
The command '/bin/sh -c if [ ! -s /kyua.tar ]; then curl -sSL "https://github.com/jmmv/atf/releases/download/atf-${ATF_VERSION}/atf-${ATF_VERSION}.tar.gz" | tar -xz -C /usr/src && cd "/usr/src/atf-${ATF_VERSION}" && ./configure --prefix /usr && make -j6 && make install && make install DESTDIR=/tmp/kyua-cache-root && cd .. && rm -rf /tmp/kyua-cache-root/usr/tests "/usr/src/atf-${ATF_VERSION}" && ldconfig && curl -sSL "https://github.com/jmmv/lutok/releases/download/lutok-${LUTOK_VERSION}/lutok-${LUTOK_VERSION}.tar.gz" | tar -xz -C /usr/src && cd "/usr/src/lutok-${LUTOK_VERSION}" && ./configure --prefix /usr && make -j6 && make install && make install DESTDIR=/tmp/kyua-cache-root && cd .. && rm -rf /tmp/kyua-cache-root/usr/tests "/usr/src/lutok-${LUTOK_VERSION}" && ldconfig && curl -sSL "https://github.com/Mno-hime/kyua/archive/${KYUA_GIT_COMMIT}.tar.gz" | tar -xz -C /usr/src && cd "/usr/src/kyua-${KYUA_GIT_COMMIT}" && sed -i "s|^set(|tree_set(|; s|^\(\s\+\)set<|\1tree_set<|;" model/metadata.cpp && ./configure --prefix /usr && make -j6 && make install && make install DESTDIR=/tmp/kyua-cache-root && cd .. && rm -rf /tmp/kyua-cache-root/usr/tests "/usr/src/kyua-${KYUA_GIT_COMMIT}" && tar --directory /tmp/kyua-cache-root --create --file /kyua.tar . ; fi' returned a non-zero code: 1
make: *** [Makefile:109: oraclelinux-7-amd64] Error 1
make: Leaving directory '/builds/mnowak/images/docker'
Cleaning up file based variables
ERROR: Job failed: exit code 2
failed
oraclelinux:6:amd64:docker Images
No package python34-pytest available.
No package python34-requests available.
No package python34-setuptools available.
Error: Nothing to do
The command '/bin/sh -c if [ "6" = "6" ]; then yum -y install GeoIP-devel python34-pip python34-ply python34-pytest python34-requests python34-setuptools ; fi' returned a non-zero code: 1
make: *** [Makefile:109: oraclelinux-6-amd64] Error 1
make: Leaving directory '/builds/mnowak/images/docker'
Cleaning up file based variables
ERROR: Job failed: exit code 2
failed
oraclelinux:8:amd64:docker Images
Dependencies resolved.
Nothing to do.
Complete!
Error: No matching repo to modify: PowerTools.
The command '/bin/sh -c if [ "8" = "8" ]; then yum -y install yum-utils && yum config-manager --enable PowerTools; fi' returned a non-zero code: 1
make: Leaving directory '/builds/mnowak/images/docker'
make: *** [Makefile:109: oraclelinux-8-amd64] Error 1
Cleaning up file based variables
ERROR: Job failed: exit code 2
failed
oraclelinux:6:i386:docker Images
touch bind9/oraclelinux-6-i386/kyua.tar
docker build --no-cache -t "registry.gitlab.isc.org/isc-projects/images/bind9-staging:oraclelinux-6-i386" "bind9/oraclelinux-6-i386"
Sending build context to Docker daemon 6.144kB
Step 1/30 : FROM i386/oraclelinux:6
pull access denied for i386/oraclelinux, repository does not exist or may require 'docker login': denied: requested access to the resource is denied
make: *** [Makefile:109: oraclelinux-6-i386] Error 1
make: Leaving directory '/builds/mnowak/images/docker'
Cleaning up file based variables
ERROR: Job failed: exit code 2